{"text_format":"3","workbook":"xlsx","n_sheets":5,"sheets":["警告","入力シート","男子参加申込書","名簿","女子参加申込書"],"not_rendered":{"macros":1,"defined_names":4,"comments":1},"read":"whole","date_system":"1900"}

{"sheet":"警告","index":0,"n_rows":12,"n_cols":1,"rows_kept":12,"hidden":true}
["マクロが無効です。"]
["申込入力を行うには，マクロを有効にする必要があります。"]
["マクロを有効にしてファイルを開いてください。"]
[]
["EXCELのバージョンが2002以降の場合，通常の状態ではマクロが有効になりません。"]
["マクロを有効にするには，"]
["１）上部メニューを「ツール(T)→マクロ(M)→セキュリティ(S)」の順に開きます。"]
["２）「セキュリティレベル」を「中」に設定してください。"]
["３）EXCELをいったん終了（ファイルを保存しない）し，再度ファイルを開きます。"]
["４）マクロを有効にするかどうか聞いてきます。ここで「マクロを有効にする」を選択します。"]
[]
["何らかの原因でマクロが停止した場合は，いったんファイルを保存し，再度開き直してください。"]

{"sheet":"入力シート","index":1,"n_rows":51,"n_cols":9,"rows_kept":51,"merged":[[0,0,0,6],[18,0,18,1],[18,2,18,4],[19,0,19,1],[19,2,19,4],[20,0,20,1],[20,2,20,4],[21,0,21,1],[21,2,21,4],[22,0,22,1],[22,2,22,4],[23,0,24,0],[23,2,23,4],[24,2,24,4],[25,0,25,1],[25,2,25,4],[26,0,26,1],[26,2,26,4],[27,0,27,1],[27,2,28,4],[28,0,28,1],[30,0,30,6],[41,0,41,6]]}
["令和7年度版 必ずお読みください！（県新人駅伝用）"]
["１．全て入力シートに入力してください。自動的に男女別の参加申込書に入力されます。"]
["２．赤字のところは必ず入力してください。（男女の監督が同じ場合は、どちらかに入力してください）"]
["３．監督（責任者）の携帯番号はできるだけご記入ください。"]
["４．登録している生徒は登録番号を入力して下さい。"]
["　（漢字に間違いがある場合、直接入力してください。）"]
["５．登録番号がない生徒は、直接入力してください。（男子１１５９、女子５３６以降は直接入力してください）"]
["６．パソコンで表示が難しい漢字の場合は備考欄に説明をご記入下さい。"]
["　（例　「嵜」の字で「立」の部分が「大」など）　各校で作成された外字を使うと、事務局のパソコンでは正しく表示されません。"]
["８．入力漏れがあった場合、印刷されません。オープン参加の場合は○を入れてください。"]
["９．男女別に参加申込書を一部印刷され、公印を押して事務局までお送りください。"]
["１０．保存ボタンを押すと、保存画面がでますので、ファイル名を学校名にして保存してください。"]
["１１．送信時は件名に　駅伝申込／（学校名）／（監督名）と記入して下さい。"]
["（例　駅伝申込／鹿町工業／鹿町太郎） 「高校」は省略してください。"]
["○送付先",null,"下をクリックするとメールソフトが起動します。"]
["nagasaki-koukouekiden@news.ed.jp"]
[]
[null,null,"↓ここから入力してください",null,null,"　★印刷後、必ず公印を押して郵送してください。"]
["学校名（正式名称）"]
["学校郵便番号",{"$nulls":6},"○"]
["学校住所"]
["学校電話番号"]
["学校長名",{"$nulls":4},"↓OPEN参加の場合○"]
["監督名","男子"]
[null,"女子"]
["審判員氏名",{"$nulls":4},"　★ファイル名を学校名にして保存してください"]
["(メールアドレス)"]
["監督携帯番号"]
["（連絡先）"]
[null,"↓登録番号を入力してください。"]
["新人駅伝　男子"]
["No.","登録番号","選手氏名","フリガナ","学年","生年月日","備考","所属チェック用","同一選手"]
[1,null,{"$f":"IF($B33=\"\",\"\",VLOOKUP($B33,名簿!$A$2:$F$1220,2,FALSE))","v":""},{"$f":"IF($B33=\"\",\"\",VLOOKUP($B33,名簿!$A$2:$F$1220,3,FALSE))","v":""},{"$f":"IF($B33=\"\",\"\",VLOOKUP($B33,名簿!$A$2:$F$1220,4,FALSE))","v":""},{"$f":"IF($B33=\"\",\"\",VLOOKUP($B33,名簿!$A$2:$F$1220,5,FALSE))","v":""},null,{"$f":"IF($B33=\"\",\"\",VLOOKUP($B33,名簿!$A$2:$F$1220,6,FALSE))","v":""},{"$f":"COUNTIF($B$33:$B$40,$B33)","v":0}]
[2,null,{"$f":"IF($B34=\"\",\"\",VLOOKUP($B34,名簿!$A$2:$F$1220,2,FALSE))","v":""},{"$f":"IF($B34=\"\",\"\",VLOOKUP($B34,名簿!$A$2:$F$1220,3,FALSE))","v":""},{"$f":"IF($B34=\"\",\"\",VLOOKUP($B34,名簿!$A$2:$F$1220,4,FALSE))","v":""},{"$f":"IF($B34=\"\",\"\",VLOOKUP($B34,名簿!$A$2:$F$1220,5,FALSE))","v":""},null,{"$f":"IF($B34=\"\",\"\",VLOOKUP($B34,名簿!$A$2:$F$1220,6,FALSE))","v":""},0]
[3,null,{"$f":"IF($B35=\"\",\"\",VLOOKUP($B35,名簿!$A$2:$F$1220,2,FALSE))","v":""},{"$f":"IF($B35=\"\",\"\",VLOOKUP($B35,名簿!$A$2:$F$1220,3,FALSE))","v":""},{"$f":"IF($B35=\"\",\"\",VLOOKUP($B35,名簿!$A$2:$F$1220,4,FALSE))","v":""},{"$f":"IF($B35=\"\",\"\",VLOOKUP($B35,名簿!$A$2:$F$1220,5,FALSE))","v":""},null,{"$f":"IF($B35=\"\",\"\",VLOOKUP($B35,名簿!$A$2:$F$1220,6,FALSE))","v":""},0]
[4,null,{"$f":"IF($B36=\"\",\"\",VLOOKUP($B36,名簿!$A$2:$F$1220,2,FALSE))","v":""},{"$f":"IF($B36=\"\",\"\",VLOOKUP($B36,名簿!$A$2:$F$1220,3,FALSE))","v":""},{"$f":"IF($B36=\"\",\"\",VLOOKUP($B36,名簿!$A$2:$F$1220,4,FALSE))","v":""},{"$f":"IF($B36=\"\",\"\",VLOOKUP($B36,名簿!$A$2:$F$1220,5,FALSE))","v":""},null,{"$f":"IF($B36=\"\",\"\",VLOOKUP($B36,名簿!$A$2:$F$1220,6,FALSE))","v":""},0]
[5,null,{"$f":"IF($B37=\"\",\"\",VLOOKUP($B37,名簿!$A$2:$F$1220,2,FALSE))","v":""},{"$f":"IF($B37=\"\",\"\",VLOOKUP($B37,名簿!$A$2:$F$1220,3,FALSE))","v":""},{"$f":"IF($B37=\"\",\"\",VLOOKUP($B37,名簿!$A$2:$F$1220,4,FALSE))","v":""},{"$f":"IF($B37=\"\",\"\",VLOOKUP($B37,名簿!$A$2:$F$1220,5,FALSE))","v":""},null,{"$f":"IF($B37=\"\",\"\",VLOOKUP($B37,名簿!$A$2:$F$1220,6,FALSE))","v":""},0]
[6,null,{"$f":"IF($B38=\"\",\"\",VLOOKUP($B38,名簿!$A$2:$F$1220,2,FALSE))","v":""},{"$f":"IF($B38=\"\",\"\",VLOOKUP($B38,名簿!$A$2:$F$1220,3,FALSE))","v":""},{"$f":"IF($B38=\"\",\"\",VLOOKUP($B38,名簿!$A$2:$F$1220,4,FALSE))","v":""},{"$f":"IF($B38=\"\",\"\",VLOOKUP($B38,名簿!$A$2:$F$1220,5,FALSE))","v":""},null,{"$f":"IF($B38=\"\",\"\",VLOOKUP($B38,名簿!$A$2:$F$1220,6,FALSE))","v":""},0]
[7,null,{"$f":"IF($B39=\"\",\"\",VLOOKUP($B39,名簿!$A$2:$F$1220,2,FALSE))","v":""},{"$f":"IF($B39=\"\",\"\",VLOOKUP($B39,名簿!$A$2:$F$1220,3,FALSE))","v":""},{"$f":"IF($B39=\"\",\"\",VLOOKUP($B39,名簿!$A$2:$F$1220,4,FALSE))","v":""},{"$f":"IF($B39=\"\",\"\",VLOOKUP($B39,名簿!$A$2:$F$1220,5,FALSE))","v":""},null,{"$f":"IF($B39=\"\",\"\",VLOOKUP($B39,名簿!$A$2:$F$1220,6,FALSE))","v":""},0]
[8,null,{"$f":"IF($B40=\"\",\"\",VLOOKUP($B40,名簿!$A$2:$F$1220,2,FALSE))","v":""},{"$f":"IF($B40=\"\",\"\",VLOOKUP($B40,名簿!$A$2:$F$1220,3,FALSE))","v":""},{"$f":"IF($B40=\"\",\"\",VLOOKUP($B40,名簿!$A$2:$F$1220,4,FALSE))","v":""},{"$f":"IF($B40=\"\",\"\",VLOOKUP($B40,名簿!$A$2:$F$1220,5,FALSE))","v":""},null,{"$f":"IF($B40=\"\",\"\",VLOOKUP($B40,名簿!$A$2:$F$1220,6,FALSE))","v":""},0]
{"$rows_left_out":12}
{"sheet":"男子参加申込書","index":2,"n_rows":36,"n_cols":11,"rows_kept":36,"hidden":true,"merged":[[1,0,1,10],[2,0,2,10],[3,0,3,10],[5,0,5,10],[7,0,7,1],[7,2,7,10],[8,0,8,1],[8,2,8,10],[9,0,9,1],[9,2,9,5],[9,6,9,8],[9,9,9,10],[12,0,13,0],[12,1,12,6],[12,7,13,7],[12,8,13,9],[12,10,13,10],[13,1,13,6],[14,0,15,0],[14,1,14,6],[14,7,15,7],[14,8,15,9],[14,10,15,10],[15,1,15,6],[16,0,17,0],[16,1,16,6],[16,7,17,7],[16,8,17,9],[16,10,17,10],[17,1,17,6],[18,0,19,0],[18,1,18,6],[18,7,19,7],[18,8,19,9],[18,10,19,10],[19,1,19,6],[20,0,21,0],[20,1,20,6],[20,7,21,7],[20,8,21,9],[20,10,21,10],[21,1,21,6],[22,0,23,0],[22,1,22,6],[22,7,23,7],[22,8,23,9],[22,10,23,10],[23,1,23,6],[24,0,25,0],[24,1,24,6],[24,7,25,7],[24,8,25,9],[24,10,25,10],[25,1,25,6],[26,0,27,0],[26,1,26,6],[26,7,27,7],[26,8,27,9],[26,10,27,10],[27,1,27,6],[28,0,29,0],[28,1,28,6],[28,7,29,7],[28,8,29,9],[28,10,29,10],[29,1,29,6],[31,0,31,9],[33,7,33,9],[35,3,35,7],[35,8,35,9]]}
[]
["令 和 7 年 度 （ 第 47 回）"]
["長崎県高等学校新人体育大会"]
["駅伝競走大会"]
[]
["参加申込書（男子）"]
[]
["学   校   名",null,{"$f":"IF(入力シート!F24=\"○\",入力シート!$C$19&\"（合同）\",入力シート!$C$19)","v":0}]
["学校所在地",null,{"$f":"\"〒 \"&入力シート!$C$20&\"　　\"&入力シート!$C$21&\"　Tel \"&入力シート!$C$22","v":"〒 　　　Tel "}]
["監　　督　　名",null,{"$f":"IF(入力シート!$C$24=\"\",入力シート!$C$25,入力シート!$C$24)","v":0},{"$nulls":3},"審判員氏名",null,null,{"$f":"入力シート!$C$26","v":0}]
[]
[]
["No.","フ　リ　ガ　ナ",{"$nulls":5},"学　年","生　　年　　月　　日",null,"所属"]
[null,"選　　手　　氏　　名"]
[1,{"$f":"VLOOKUP($A15,入力シート!$A$33:$G$41,4,FALSE)","v":""},{"$nulls":5},{"$f":"VLOOKUP($A15,入力シート!$A$33:$G$41,5,FALSE)","v":""},{"$f":"VLOOKUP($A15,入力シート!$A$33:$G$41,6,FALSE)","v":""},{"$f":"VLOOKUP($A15,入力シート!$A$33:$G$40,5,FALSE)","v":""},{"$f":"IF(入力シート!$F$24=\"○\",VLOOKUP($A15,入力シート!$A$33:$H$41,8,FALSE),\"\")","v":""}]
[null,{"$f":"VLOOKUP($A15,入力シート!$A$33:$G$41,3,FALSE)","v":""},{"$nulls":5},{"$f":"VLOOKUP($A15,入力シート!$A$33:$G$40,3,FALSE)","v":""},{"$f":"VLOOKUP($A15,入力シート!$A$33:$G$40,3,FALSE)","v":""},{"$f":"VLOOKUP($A15,入力シート!$A$33:$G$40,3,FALSE)","v":""}]
[2,{"$f":"VLOOKUP($A17,入力シート!$A$33:$G$41,4,FALSE)","v":""},{"$nulls":5},{"$f":"VLOOKUP($A17,入力シート!$A$33:$G$41,5,FALSE)","v":""},{"$f":"VLOOKUP($A17,入力シート!$A$33:$G$41,6,FALSE)","v":""},{"$f":"VLOOKUP($A17,入力シート!$A$33:$G$40,5,FALSE)","v":""},{"$f":"IF(入力シート!$F$24=\"○\",VLOOKUP($A17,入力シート!$A$33:$H$41,8,FALSE),\"\")","v":""}]
[null,{"$f":"VLOOKUP($A17,入力シート!$A$33:$G$41,3,FALSE)","v":""},{"$nulls":5},{"$f":"VLOOKUP($A17,入力シート!$A$33:$G$40,3,FALSE)","v":""},{"$f":"VLOOKUP($A17,入力シート!$A$33:$G$40,3,FALSE)","v":""},{"$f":"VLOOKUP($A17,入力シート!$A$33:$G$40,3,FALSE)","v":""}]
[3,{"$f":"VLOOKUP($A19,入力シート!$A$33:$G$41,4,FALSE)","v":""},{"$nulls":5},{"$f":"VLOOKUP($A19,入力シート!$A$33:$G$41,5,FALSE)","v":""},{"$f":"VLOOKUP($A19,入力シート!$A$33:$G$41,6,FALSE)","v":""},{"$f":"VLOOKUP($A19,入力シート!$A$33:$G$40,5,FALSE)","v":""},{"$f":"IF(入力シート!$F$24=\"○\",VLOOKUP($A19,入力シート!$A$33:$H$41,8,FALSE),\"\")","v":""}]
[null,{"$f":"VLOOKUP($A19,入力シート!$A$33:$G$41,3,FALSE)","v":""},{"$nulls":5},{"$f":"VLOOKUP($A19,入力シート!$A$33:$G$40,3,FALSE)","v":""},{"$f":"VLOOKUP($A19,入力シート!$A$33:$G$40,3,FALSE)","v":""},{"$f":"VLOOKUP($A19,入力シート!$A$33:$G$40,3,FALSE)","v":""}]
[4,{"$f":"VLOOKUP($A21,入力シート!$A$33:$G$41,4,FALSE)","v":""},{"$nulls":5},{"$f":"VLOOKUP($A21,入力シート!$A$33:$G$41,5,FALSE)","v":""},{"$f":"VLOOKUP($A21,入力シート!$A$33:$G$41,6,FALSE)","v":""},{"$f":"VLOOKUP($A21,入力シート!$A$33:$G$40,5,FALSE)","v":""},{"$f":"IF(入力シート!$F$24=\"○\",VLOOKUP($A21,入力シート!$A$33:$H$41,8,FALSE),\"\")","v":""}]
[null,{"$f":"VLOOKUP($A21,入力シート!$A$33:$G$41,3,FALSE)","v":""},{"$nulls":5},{"$f":"VLOOKUP($A21,入力シート!$A$33:$G$40,3,FALSE)","v":""},{"$f":"VLOOKUP($A21,入力シート!$A$33:$G$40,3,FALSE)","v":""},{"$f":"VLOOKUP($A21,入力シート!$A$33:$G$40,3,FALSE)","v":""}]
[5,{"$f":"VLOOKUP($A23,入力シート!$A$33:$G$41,4,FALSE)","v":""},{"$nulls":5},{"$f":"VLOOKUP($A23,入力シート!$A$33:$G$41,5,FALSE)","v":""},{"$f":"VLOOKUP($A23,入力シート!$A$33:$G$41,6,FALSE)","v":""},{"$f":"VLOOKUP($A23,入力シート!$A$33:$G$40,5,FALSE)","v":""},{"$f":"IF(入力シート!$F$24=\"○\",VLOOKUP($A23,入力シート!$A$33:$H$41,8,FALSE),\"\")","v":""}]
[null,{"$f":"VLOOKUP($A23,入力シート!$A$33:$G$41,3,FALSE)","v":""},{"$nulls":5},{"$f":"VLOOKUP($A23,入力シート!$A$33:$G$40,3,FALSE)","v":""},{"$f":"VLOOKUP($A23,入力シート!$A$33:$G$40,3,FALSE)","v":""},{"$f":"VLOOKUP($A23,入力シート!$A$33:$G$40,3,FALSE)","v":""}]
[6,{"$f":"VLOOKUP($A25,入力シート!$A$33:$G$41,4,FALSE)","v":""},{"$nulls":5},{"$f":"VLOOKUP($A25,入力シート!$A$33:$G$41,5,FALSE)","v":""},{"$f":"VLOOKUP($A25,入力シート!$A$33:$G$41,6,FALSE)","v":""},{"$f":"VLOOKUP($A25,入力シート!$A$33:$G$40,5,FALSE)","v":""},{"$f":"IF(入力シート!$F$24=\"○\",VLOOKUP($A25,入力シート!$A$33:$H$41,8,FALSE),\"\")","v":""}]
[null,{"$f":"VLOOKUP($A25,入力シート!$A$33:$G$41,3,FALSE)","v":""},{"$nulls":5},{"$f":"VLOOKUP($A25,入力シート!$A$33:$G$40,3,FALSE)","v":""},{"$f":"VLOOKUP($A25,入力シート!$A$33:$G$40,3,FALSE)","v":""},{"$f":"VLOOKUP($A25,入力シート!$A$33:$G$40,3,FALSE)","v":""}]
[7,{"$f":"VLOOKUP($A27,入力シート!$A$33:$G$41,4,FALSE)","v":""},{"$nulls":5},{"$f":"VLOOKUP($A27,入力シート!$A$33:$G$41,5,FALSE)","v":""},{"$f":"VLOOKUP($A27,入力シート!$A$33:$G$41,6,FALSE)","v":""},{"$f":"VLOOKUP($A27,入力シート!$A$33:$G$40,5,FALSE)","v":""},{"$f":"IF(入力シート!$F$24=\"○\",VLOOKUP($A27,入力シート!$A$33:$H$41,8,FALSE),\"\")","v":""}]
[null,{"$f":"VLOOKUP($A27,入力シート!$A$33:$G$41,3,FALSE)","v":""},{"$nulls":5},{"$f":"VLOOKUP($A27,入力シート!$A$33:$G$40,3,FALSE)","v":""},{"$f":"VLOOKUP($A27,入力シート!$A$33:$G$40,3,FALSE)","v":""},{"$f":"VLOOKUP($A27,入力シート!$A$33:$G$40,3,FALSE)","v":""}]
[8,{"$f":"VLOOKUP($A29,入力シート!$A$33:$G$41,4,FALSE)","v":""},{"$nulls":5},{"$f":"VLOOKUP($A29,入力シート!$A$33:$G$41,5,FALSE)","v":""},{"$f":"VLOOKUP($A29,入力シート!$A$33:$G$41,6,FALSE)","v":""},{"$f":"VLOOKUP($A29,入力シート!$A$33:$G$40,5,FALSE)","v":""},{"$f":"IF(入力シート!$F$24=\"○\",VLOOKUP($A29,入力シート!$A$33:$H$41,8,FALSE),\"\")","v":""}]
[null,{"$f":"VLOOKUP($A29,入力シート!$A$33:$G$41,3,FALSE)","v":""},{"$nulls":5},{"$f":"VLOOKUP($A29,入力シート!$A$33:$G$40,3,FALSE)","v":""},{"$f":"VLOOKUP($A29,入力シート!$A$33:$G$40,3,FALSE)","v":""},{"$f":"VLOOKUP($A29,入力シート!$A$33:$G$40,3,FALSE)","v":""}]
[]
["上記のものは本校在学生徒で、標記大会に出場することを認め参加を申し込みます。"]
[]
[{"$nulls":5},"　",null,"令和7年　　　月　　　日"]
[]
[{"$nulls":3},{"$f":"入力シート!$C$19&\"長\"","v":"長"},{"$nulls":4},{"$f":"入力シート!$C$23","v":0}]

{"sheet":"名簿","index":3,"n_rows":1164,"n_cols":14,"rows_kept":1164,"hidden":true}
["番号","氏名","ふりがな","学年","生年月日","所属",null,null,"番号","氏名","ふりがな","学年","生年月日","所属"]
[1,"北川　智也","ｷﾀｶﾞﾜ ﾄﾓﾔ",3,"2007-11-04","佐世保実",null,null,1,"石崎　姫乃","ｲｼｻﾞｷ ﾋﾒﾉ",3,"2008-02-14","創成館"]
[2,"川原　颯真","ｶﾜﾊﾗ ｿｳﾏ",3,"2007-10-13","佐世保実",null,null,2,"今里あんり","ｲﾏｻﾞﾄ ｱﾝﾘ",3,"2007-04-08","創成館"]
[3,"井上　礼也","ｲﾉｳｴ ﾚｲﾔ",3,"2007-08-29","佐世保実",null,null,3,"川島　彩良","ｶﾜｼﾏ ｻﾗ",3,"2007-08-18","創成館"]
[4,"楠元　翔","ｸｽﾓﾄ ｼｮｳ",2,"2008-08-14","佐世保実",null,null,4,"桑原　姫生","ｸﾜﾊﾗ ｷﾗ",3,"2007-06-07","創成館"]
[5,"中島　倖太","ﾅｶｼﾏ ｺｳﾀ",2,"2008-12-01","佐世保実",null,null,5,"高谷　琴乃","ﾀｶﾔ ｺﾄﾉ",3,"2007-09-01","創成館"]
[6,"小島　大征","ｺｼﾞﾏ ﾀｲｾｲ",3,"2008-01-19","創成館",null,null,6,"濱口　嘉恋","ﾊﾏｸﾞﾁ ｶﾚﾝ",3,"2007-11-28","創成館"]
[7,"重松　徠人","ｼｹﾞﾏﾂ ﾗｲﾄ",3,"2007-11-19","創成館",null,null,7,"宮崎　莉音","ﾐﾔｻﾞｷ ﾘｵﾝ",2,"2009-01-23","創成館"]
[8,"菅　侑大","ｽｶﾞ ﾕｳﾀﾞｲ",3,"2007-07-26","創成館",null,null,8,"馬渡　花楓","ﾏﾜﾀﾘ ｶｴﾗ",2,"2008-05-19","創成館"]
[9,"林田　一馬","ﾊﾔｼﾀﾞ ｶｽﾞﾏ",3,"2007-08-16","創成館",null,null,9,"井上　優那","ｲﾉｳｴ ﾕﾅ",2,"2009-02-20","創成館"]
[10,"村上　大翔","ﾑﾗｶﾐ ﾀｲｶﾞ",3,"2007-04-16","創成館",null,null,10,"藤山　　絆","ﾌｼﾞﾔﾏ ｷｽﾞﾅ",2,"2009-01-29","創成館"]
[11,"吉津　圭悟","ﾖｼﾂﾞ ｹｲｺﾞ",3,"2007-11-28","創成館",null,null,11,"森　　若菜","ﾓﾘ ﾜｶﾅ",2,"2008-11-01","創成館"]
[12,"水口　翔太","ﾐｽﾞｸﾞﾁ ｼｮｳﾀ",3,"2007-07-01","創成館",null,null,12,"田口　蓮咲","ﾀｸﾞﾁ ﾊｵ",3,"2008-03-12","九州文化"]
[13,"井上　啓太","ｲﾉｳｴ ｹｲﾀ",3,"2007-11-08","創成館",null,null,13,"小佐々理奈","ｺｻｻ ﾘﾅ",3,"2007-04-25","西海学園"]
[14,"田栗　蒼空","ﾀｸﾞﾘ ｿﾗ",3,"2007-11-12","創成館",null,null,14,"柴田　歩璃","ｼﾊﾞﾀ ｱﾕﾘ",3,"2007-07-25","西海学園"]
[15,"瀬川　秋桜","ｾｶﾞﾜ ｼｭｳｳｵｳ",2,"2008-09-09","創成館",null,null,15,"山之内　倫","ﾔﾏﾉｳﾁ 倫",3,"2008-02-19","西海学園"]
[16,"大窄　麗斗","ｵｵｻｺ ﾚｲﾄ",2,"2008-10-18","創成館",null,null,16,"長島　亜美","ﾅｶﾞｼﾏ ｱﾐ",2,"2008-06-20","西海学園"]
[17,"山口　湧晟","ﾔﾏｸﾞﾁ ﾕｳｾｲ",2,"2008-09-05","創成館",null,null,17,"葛屋　桜香","ｶﾂﾔ ｵｳｶ",3,"2007-09-10","長崎女"]
[18,"安野　叶人","ﾔｽﾉ ｶﾅﾄ",2,"2009-03-20","創成館",null,null,18,"久壽米木結衣","ｸｽﾒｷ ﾕｲ",3,"2007-12-16","長崎女"]
[19,"髙田　優剛","ﾀｶﾀﾞ ﾕｳｺﾞｳ",2,"2008-04-25","創成館",null,null,19,"福用　朝陽","ﾌｸﾖｳ ｱｻﾋ",3,"2007-04-17","長崎女"]
[20,"濱田　結雅","ﾊﾏﾀﾞ ﾕｳｶﾞ",2,"2009-01-07","創成館",null,null,20,"山下　咲稀","ﾔﾏｼﾀ ｻｷ",3,"2008-01-03","長崎女"]
[21,"川井　流輝","ｶﾜｲ ﾘｭｳｷ",2,"2008-09-08","創成館",null,null,21,"渡邉　姫乃","ﾜﾀﾅﾍﾞ ﾋﾒﾉ",3,"2007-11-10","長崎女"]
[22,"白石　陣","ｼﾗｲｼ ｼﾞﾝ",2,"2008-10-29","創成館",null,null,22,"水谷　美咲","ﾐｽﾞﾀﾆ ﾐｻｷ",3,"2007-05-14","長崎女"]
[23,"木山　堅斗","ｷﾔﾏ ｹﾝﾄ",2,"2008-06-18","創成館",null,null,23,"宮本　結愛","ﾐﾔﾓﾄ ﾕﾅ",3,"2007-04-22","長崎女"]
[24,"大町　爽翔","ｵｵﾏﾁ ｿｳﾊ",1,"2009-11-11","創成館",null,null,24,"髙田しずく","ﾀｶﾀ ｼｽﾞｸ",3,"2008-03-24","長崎女"]
[25,"下田　陸王","ｼﾓﾀﾞ ﾚｵ",1,"2009-08-08","創成館",null,null,25,"永山　萌子","ﾅｶﾞﾔﾏ ﾓｺ",3,"2007-11-26","長崎女"]
[26,"山口　紋治郎","ﾔﾏｸﾞﾁ ﾓﾝｼﾞﾛｳ",1,"2010-01-27","創成館",null,null,26,"平間　ひな","ﾍｲﾏ ﾋﾅ",2,"2008-10-03","長崎女"]
[27,"上瀧　蓮","ｳﾜﾀｷ ﾚﾝ",3,"2007-09-06","希望が丘高等",null,null,27,"西田みさき","ﾆｼﾀﾞ ﾐｻｷ",2,"2008-09-18","長崎女"]
[28,"大川内　柚樹","ｵｵｶﾜﾁ ﾕﾂﾞｷ",3,"2008-02-23","希望が丘高等",null,null,28,"田中　聖恋","ﾀﾅｶ ｾﾚﾝ",2,"2008-12-12","長崎女"]
[29,"川崎　虎希","ｶﾜｻｷ ｺｳｷ",3,"2007-06-27","希望が丘高等",null,null,29,"松尾　瑳姫","ﾏﾂｵ ｻｷ",1,"2010-01-06","長崎女"]
[30,"小島　蓮","ｺｼﾞﾏ ﾚﾝ",3,"2007-11-12","希望が丘高等",null,null,30,"西村　愛珠","ﾆｼﾑﾗ ｱｲｼﾞｭ",1,"2009-09-09","長崎女"]
[31,"佐藤　翔一","ｻﾄｳ ｼｮｳｲﾁ",3,"2008-03-03","希望が丘高等",null,null,31,"岩永　詩花","ｲﾜﾅｶﾞ ｼｲｶ",1,"2010-01-28","長崎女"]
[32,"山口　悠斗","ﾔﾏｸﾞﾁ ﾕｳﾄ",3,"2008-01-31","希望が丘高等",null,null,32,"古野　花梨","ｺﾉ ｶﾘﾝ",1,"2009-05-26","長崎女"]
[33,"垣内　斗真","ｶｷｳﾁ ﾄｳﾏ",3,"2008-03-06","希望が丘高等",null,null,33,"中島　結菜","ﾅｶｼﾏ ﾕｲﾅ",1,"2009-08-03","長崎女"]
[34,"山口　知樹","ﾔﾏｸﾞﾁ ﾄﾓｷ",2,"2009-01-01","希望が丘高等",null,null,34,"中村玲央奈","ﾅｶﾑﾗ ﾚｵﾅ",1,"2010-02-24","長崎女"]
[35,"中村　直人","ﾅｶﾑﾗ ﾅｵﾄ",2,"2008-05-15","希望が丘高等",null,null,35,"早田　歩未","ｿｳﾀﾞ ｱﾕﾐ",1,"2009-09-20","長崎女"]
[36,"峰　　智也","ﾐﾈ ﾄﾓﾔ",2,"2009-03-15","希望が丘高等",null,null,36,"原　　叶恋","ﾊﾗ ｶﾚﾝ",1,"2009-10-13","長崎女"]
[37,"馬場　大和","ババ ヤマト",2,"2008-12-10","希望が丘高等",null,null,37,"大塚　茉歩","ｵｵﾂｶ ﾏﾎ",1,"2009-08-28","長崎女"]
[38,"上谷　優寿希","ｳｴﾀﾆ ﾕｽﾞｷ",2,"2009-01-16","希望が丘高等",null,null,38,"河上　夏帆","ｶﾜｶﾐ ｶﾎ",1,"2009-08-05","長崎女"]
[39,"大平　夏輝","ｵｵﾋﾗ ﾅﾂｷ",3,"2007-09-25","九州文化",null,null,39,"迎　　心愛","ﾑｶｴ ｺｱ",3,"2008-01-28","ろう"]
{"$rows_left_out":1125}
{"sheet":"女子参加申込書","index":4,"n_rows":35,"n_cols":11,"rows_kept":35,"hidden":true,"merged":[[1,0,1,9],[2,0,2,9],[3,0,3,9],[5,0,5,9],[7,0,7,1],[7,2,7,10],[8,0,8,1],[8,2,8,10],[9,0,9,1],[9,2,9,5],[9,6,9,8],[9,9,9,10],[12,0,13,0],[12,1,12,6],[12,7,13,7],[12,8,13,9],[12,10,13,10],[13,1,13,6],[14,0,15,0],[14,1,14,6],[14,7,15,7],[14,8,15,9],[14,10,15,10],[15,1,15,6],[16,0,17,0],[16,1,16,6],[16,7,17,7],[16,8,17,9],[16,10,17,10],[17,1,17,6],[18,0,19,0],[18,1,18,6],[18,7,19,7],[18,8,19,9],[18,10,19,10],[19,1,19,6],[20,0,21,0],[20,1,20,6],[20,7,21,7],[20,8,21,9],[20,10,21,10],[21,1,21,6],[22,0,23,0],[22,1,22,6],[22,7,23,7],[22,8,23,9],[22,10,23,10],[23,1,23,6],[24,0,25,0],[24,1,24,6],[24,7,25,7],[24,8,25,9],[24,10,25,10],[25,1,25,6],[26,0,27,0],[26,1,26,6],[26,7,27,7],[26,8,27,9],[26,10,27,10],[27,1,27,6],[28,0,29,0],[28,1,28,6],[28,7,29,7],[28,8,29,9],[28,10,29,10],[29,1,29,6],[30,0,30,9],[32,7,32,9],[34,3,34,7],[34,8,34,9]]}
[]
["令 和 7 年 度 （ 第 37 回）"]
["長崎県高等学校新人体育大会"]
["駅伝競走大会"]
[]
["参加申込書（女子）"]
[]
["学   校   名",null,{"$f":"IF(入力シート!F25=\"○\",入力シート!$C$19&\"（合同）\",入力シート!$C$19)","v":0}]
["学校所在地",null,{"$f":"\"〒 \"&入力シート!$C$20&\"　　\"&入力シート!$C$21&\"　Tel \"&入力シート!$C$22","v":"〒 　　　Tel "}]
["監　　督　　名",null,{"$f":"IF(入力シート!$C$25=\"\",入力シート!$C$24,入力シート!$C$25)","v":0},{"$nulls":3},"審判員氏名",null,null,{"$f":"入力シート!$C$26","v":0}]
[]
[]
["No.","フ　リ　ガ　ナ",{"$nulls":5},"学　　年","生　　年　　月　　日",null,"所属"]
[null,"選　　手　　氏　　名"]
[1,{"$f":"VLOOKUP($A15,入力シート!$A$44:$G$51,4,FALSE)","v":""},{"$nulls":5},{"$f":"VLOOKUP($A15,入力シート!$A$44:$G$51,5,FALSE)","v":""},{"$f":"VLOOKUP($A15,入力シート!$A$44:$G$51,6,FALSE)","v":""},{"$f":"VLOOKUP($A15,入力シート!$A$33:$G$40,5,FALSE)","v":""},{"$f":"IF(入力シート!$F$25=\"○\",VLOOKUP($A15,入力シート!$A$44:$H$51,8,FALSE),\"\")","v":""}]
[null,{"$f":"VLOOKUP($A15,入力シート!$A$44:$G$51,3,FALSE)","v":""},{"$nulls":5},{"$f":"VLOOKUP($A15,入力シート!$A$33:$G$40,3,FALSE)","v":""},{"$f":"VLOOKUP($A15,入力シート!$A$33:$G$40,3,FALSE)","v":""},{"$f":"VLOOKUP($A15,入力シート!$A$33:$G$40,3,FALSE)","v":""}]
[2,{"$f":"VLOOKUP($A17,入力シート!$A$44:$G$51,4,FALSE)","v":""},{"$nulls":5},{"$f":"VLOOKUP($A17,入力シート!$A$44:$G$51,5,FALSE)","v":""},{"$f":"VLOOKUP($A17,入力シート!$A$44:$G$51,6,FALSE)","v":""},{"$f":"VLOOKUP($A17,入力シート!$A$33:$G$40,5,FALSE)","v":""},{"$f":"IF(入力シート!$F$25=\"○\",VLOOKUP($A17,入力シート!$A$44:$H$51,8,FALSE),\"\")","v":""}]
[null,{"$f":"VLOOKUP($A17,入力シート!$A$44:$G$51,3,FALSE)","v":""},{"$nulls":5},{"$f":"VLOOKUP($A17,入力シート!$A$33:$G$40,3,FALSE)","v":""},{"$f":"VLOOKUP($A17,入力シート!$A$33:$G$40,3,FALSE)","v":""},{"$f":"VLOOKUP($A17,入力シート!$A$33:$G$40,3,FALSE)","v":""}]
[3,{"$f":"VLOOKUP($A19,入力シート!$A$44:$G$51,4,FALSE)","v":""},{"$nulls":5},{"$f":"VLOOKUP($A19,入力シート!$A$44:$G$51,5,FALSE)","v":""},{"$f":"VLOOKUP($A19,入力シート!$A$44:$G$51,6,FALSE)","v":""},{"$f":"VLOOKUP($A19,入力シート!$A$33:$G$40,5,FALSE)","v":""},{"$f":"IF(入力シート!$F$25=\"○\",VLOOKUP($A19,入力シート!$A$44:$H$51,8,FALSE),\"\")","v":""}]
[null,{"$f":"VLOOKUP($A19,入力シート!$A$44:$G$51,3,FALSE)","v":""},{"$nulls":5},{"$f":"VLOOKUP($A19,入力シート!$A$33:$G$40,3,FALSE)","v":""},{"$f":"VLOOKUP($A19,入力シート!$A$33:$G$40,3,FALSE)","v":""},{"$f":"VLOOKUP($A19,入力シート!$A$33:$G$40,3,FALSE)","v":""}]
[4,{"$f":"VLOOKUP($A21,入力シート!$A$44:$G$51,4,FALSE)","v":""},{"$nulls":5},{"$f":"VLOOKUP($A21,入力シート!$A$44:$G$51,5,FALSE)","v":""},{"$f":"VLOOKUP($A21,入力シート!$A$44:$G$51,6,FALSE)","v":""},{"$f":"VLOOKUP($A21,入力シート!$A$33:$G$40,5,FALSE)","v":""},{"$f":"IF(入力シート!$F$25=\"○\",VLOOKUP($A21,入力シート!$A$44:$H$51,8,FALSE),\"\")","v":""}]
[null,{"$f":"VLOOKUP($A21,入力シート!$A$44:$G$51,3,FALSE)","v":""},{"$nulls":5},{"$f":"VLOOKUP($A21,入力シート!$A$33:$G$40,3,FALSE)","v":""},{"$f":"VLOOKUP($A21,入力シート!$A$33:$G$40,3,FALSE)","v":""},{"$f":"VLOOKUP($A21,入力シート!$A$33:$G$40,3,FALSE)","v":""}]
[5,{"$f":"VLOOKUP($A23,入力シート!$A$44:$G$51,4,FALSE)","v":""},{"$nulls":5},{"$f":"VLOOKUP($A23,入力シート!$A$44:$G$51,5,FALSE)","v":""},{"$f":"VLOOKUP($A23,入力シート!$A$44:$G$51,6,FALSE)","v":""},{"$f":"VLOOKUP($A23,入力シート!$A$33:$G$40,5,FALSE)","v":""},{"$f":"IF(入力シート!$F$25=\"○\",VLOOKUP($A23,入力シート!$A$44:$H$51,8,FALSE),\"\")","v":""}]
[null,{"$f":"VLOOKUP($A23,入力シート!$A$44:$G$51,3,FALSE)","v":""},{"$nulls":5},{"$f":"VLOOKUP($A23,入力シート!$A$33:$G$40,3,FALSE)","v":""},{"$f":"VLOOKUP($A23,入力シート!$A$33:$G$40,3,FALSE)","v":""},{"$f":"VLOOKUP($A23,入力シート!$A$33:$G$40,3,FALSE)","v":""}]
[6,{"$f":"VLOOKUP($A25,入力シート!$A$44:$G$51,4,FALSE)","v":""},{"$nulls":5},{"$f":"VLOOKUP($A25,入力シート!$A$44:$G$51,5,FALSE)","v":""},{"$f":"VLOOKUP($A25,入力シート!$A$44:$G$51,6,FALSE)","v":""},{"$f":"VLOOKUP($A25,入力シート!$A$33:$G$40,5,FALSE)","v":""},{"$f":"IF(入力シート!$F$25=\"○\",VLOOKUP($A25,入力シート!$A$44:$H$51,8,FALSE),\"\")","v":""}]
[null,{"$f":"VLOOKUP($A25,入力シート!$A$44:$G$51,3,FALSE)","v":""},{"$nulls":5},{"$f":"VLOOKUP($A25,入力シート!$A$33:$G$40,3,FALSE)","v":""},{"$f":"VLOOKUP($A25,入力シート!$A$33:$G$40,3,FALSE)","v":""},{"$f":"VLOOKUP($A25,入力シート!$A$33:$G$40,3,FALSE)","v":""}]
[7,{"$f":"VLOOKUP($A27,入力シート!$A$44:$G$51,4,FALSE)","v":""},{"$nulls":5},{"$f":"VLOOKUP($A27,入力シート!$A$44:$G$51,5,FALSE)","v":""},{"$f":"VLOOKUP($A27,入力シート!$A$44:$G$51,6,FALSE)","v":""},{"$f":"VLOOKUP($A27,入力シート!$A$33:$G$40,5,FALSE)","v":""},{"$f":"IF(入力シート!$F$25=\"○\",VLOOKUP($A27,入力シート!$A$44:$H$51,8,FALSE),\"\")","v":""}]
[null,{"$f":"VLOOKUP($A27,入力シート!$A$44:$G$51,3,FALSE)","v":""},{"$nulls":5},{"$f":"VLOOKUP($A27,入力シート!$A$33:$G$40,3,FALSE)","v":""},{"$f":"VLOOKUP($A27,入力シート!$A$33:$G$40,3,FALSE)","v":""},{"$f":"VLOOKUP($A27,入力シート!$A$33:$G$40,3,FALSE)","v":""}]
[8,{"$f":"VLOOKUP($A29,入力シート!$A$44:$G$51,4,FALSE)","v":""},{"$nulls":5},{"$f":"VLOOKUP($A29,入力シート!$A$44:$G$51,5,FALSE)","v":""},{"$f":"VLOOKUP($A29,入力シート!$A$44:$G$51,6,FALSE)","v":""},{"$f":"VLOOKUP($A29,入力シート!$A$33:$G$40,5,FALSE)","v":""},{"$f":"IF(入力シート!$F$25=\"○\",VLOOKUP($A29,入力シート!$A$44:$H$51,8,FALSE),\"\")","v":""}]
[null,{"$f":"VLOOKUP($A29,入力シート!$A$44:$G$51,3,FALSE)","v":""},{"$nulls":5},{"$f":"VLOOKUP($A29,入力シート!$A$33:$G$40,3,FALSE)","v":""},{"$f":"VLOOKUP($A29,入力シート!$A$33:$G$40,3,FALSE)","v":""},{"$f":"VLOOKUP($A29,入力シート!$A$33:$G$40,3,FALSE)","v":""}]
["上記のものは本校在学生徒で、標記大会に出場することを認め参加を申し込みます。"]
[]
[{"$nulls":5},"　",null,"令和7年　　　月　　　日"]
[]
[{"$nulls":3},{"$f":"入力シート!$C$19&\"長\"","v":"長"},{"$nulls":4},{"$f":"入力シート!$C$23","v":0}]